Target
Substance-K receptor
Ligand
BDBM50079409
Substrate
Meas. Tech.
ChEMBL_209198 (CHEMBL857059)
IC50
107.15±n/a nM
Citation
 Gembitsky, DSMurnin, MOtvös, FLAllen, JMurphy, RFLovas, S Importance of the aromatic residue at position 6 of [Nle(10)]neurokinin A(4-10) for binding to the NK-2 receptor and receptor activation. J Med Chem 42:3004-7 (1999)  
Target
Name:
Substance-K receptor
Synonyms:
NK-2 receptor NK2R NKNAR Neurokinin A receptor Neurokinin-2 (NK-2) SKR TACR2 Tachykinin receptor 2 (NK2) | hnk-3
Type:
Protein
Mol. Mass.:
44455.78
Organism:
Homo sapiens (Human)
Description:
P21452
Residue:
398
  
Inhibitor
Name:
BDBM50079409
Synonyms:
Asp-Thr-p-F-Phe-Val-Gly-Leu-Nle-NH2 | CHEMBL103634
Type:
Small organic molecule
Emp. Form.:
C37H59FN8O10
Mol. Mass.:
794.9104
SMILES:
CC(C)CC[C@H](NC(=O)[C@H](CC(C)C)NC(=O)CNC(=O)[C@@H](NC(=O)[C@H](Cc1ccc(F)cc1)NC(=O)[C@@H](NC(=O)[C@@H](N)CC(O)=O)[C@@H](C)O)C(C)C)C(N)=O
: