Target
Kappa-type opioid receptor
Ligand
BDBM50080470
Substrate
Meas. Tech.
ChEMBL_146797 (CHEMBL756052)
Ki
677±n/a nM
Citation
 Ananthan, SKezar, HSCarter, RLSaini, SKRice, KCWells, JLDavis, PXu, HDersch, CMBilsky, EJPorreca, FRothman, RB Synthesis, opioid receptor binding, and biological activities of naltrexone-derived pyrido- and pyrimidomorphinans. J Med Chem 42:3527-38 (1999)  
Target
Name:
Kappa-type opioid receptor
Synonyms:
Kappa Opioid Receptor OPRK1 Opiate Kappa 1 | mu/kappa opioid receptor
Type:
G Protein-Coupled Receptor (GPCR)
Mol. Mass.:
42744.99
Organism:
Cavia porcellus (domestic guinea pig)
Description:
P41144
Residue:
380
  
Inhibitor
Name:
BDBM50080470
Synonyms:
17-(Cyclopropyl-methyl) -6, 7-didehydro-3,14-dihydroxy-4,5alpha-epoxy-6'-methyl-4'-phenylpyrido-[2',3':6,7]morphinan | CHEMBL118487
Type:
Small organic molecule
Emp. Form.:
C30H30N2O3
Mol. Mass.:
466.5708
SMILES:
Cc1cc(-c2ccccc2)c2C[C@@]3(O)[C@H]4Cc5ccc(O)c6OC(c2n1)[C@]3(CCN4CC1CC1)c56
: