Target
Kappa-type opioid receptor
Ligand
BDBM50001189
Substrate
Meas. Tech.
ChEMBL_146797 (CHEMBL756052)
Ki
272±n/a nM
Citation
 Ananthan, SKezar, HSCarter, RLSaini, SKRice, KCWells, JLDavis, PXu, HDersch, CMBilsky, EJPorreca, FRothman, RB Synthesis, opioid receptor binding, and biological activities of naltrexone-derived pyrido- and pyrimidomorphinans. J Med Chem 42:3527-38 (1999)  
Target
Name:
Kappa-type opioid receptor
Synonyms:
Kappa Opioid Receptor OPRK1 Opiate Kappa 1 | mu/kappa opioid receptor
Type:
G Protein-Coupled Receptor (GPCR)
Mol. Mass.:
42744.99
Organism:
Cavia porcellus (domestic guinea pig)
Description:
P41144
Residue:
380
  
Inhibitor
Name:
BDBM50001189
Synonyms:
CHEMBL2112573
Type:
Small organic molecule
Emp. Form.:
C33H30N2O3
Mol. Mass.:
502.6029
SMILES:
[H][C@@]12Oc3c4c(C[C@@]5([H])N(CC6CC6)CC[C@@]14[C@@]5(O)Cc1c2nc2ccccc2c1-c1ccccc1)ccc3O
: