Target
Delta-type opioid receptor
Ligand
BDBM50001196
Substrate
Meas. Tech.
ChEMBL_146319 (CHEMBL758109)
Ki
3.4±n/a nM
Citation
 Ananthan, SKezar, HSCarter, RLSaini, SKRice, KCWells, JLDavis, PXu, HDersch, CMBilsky, EJPorreca, FRothman, RB Synthesis, opioid receptor binding, and biological activities of naltrexone-derived pyrido- and pyrimidomorphinans. J Med Chem 42:3527-38 (1999)  
Target
Name:
Delta-type opioid receptor
Synonyms:
DOR-1 MSL-2 OPRD_MOUSE Oprd1
Type:
Enzyme Catalytic Domain
Mol. Mass.:
40577.25
Organism:
MOUSE
Description:
P32300
Residue:
372
  
Inhibitor
Name:
BDBM50001196
Synonyms:
CHEMBL610522
Type:
Small organic molecule
Emp. Form.:
C29H28N2O3
Mol. Mass.:
452.5442
SMILES:
[H][C@@]12Oc3c4c(C[C@@]5([H])N(CC6CC6)CC[C@@]14[C@@]5(O)Cc1cc(cnc21)-c1ccccc1)ccc3O
: