Target
Delta-type opioid receptor
Ligand
BDBM50001191
Substrate
Meas. Tech.
ChEMBL_147191 (CHEMBL759364)
Ki
23±n/a nM
Citation
 Ananthan, SKezar, HSCarter, RLSaini, SKRice, KCWells, JLDavis, PXu, HDersch, CMBilsky, EJPorreca, FRothman, RB Synthesis, opioid receptor binding, and biological activities of naltrexone-derived pyrido- and pyrimidomorphinans. J Med Chem 42:3527-38 (1999)  
Target
Name:
Delta-type opioid receptor
Synonyms:
Cytochrome P450 3A4 Delta opioid receptor Delta-type opioid receptor (DOR) OPRD_RAT Opioid receptor Opioid receptors; mu & delta Ror-a | Voltage-gated potassium channel
Type:
G Protein-Coupled Receptor (GPCR)
Mol. Mass.:
40465.04
Organism:
Rattus norvegicus (rat)
Description:
Competition binding assays were using CHO-K1 cell membranes expressing the opioid receptor.
Residue:
372
  
Inhibitor
Name:
BDBM50001191
Synonyms:
CHEMBL2112575
Type:
Small organic molecule
Emp. Form.:
C23H25N3O3
Mol. Mass.:
391.4629
SMILES:
[H][C@@]12Oc3c4c(C[C@@]5([H])N(CC6CC6)CC[C@@]14[C@@]5(O)Cc1cnc(C)nc21)ccc3O
: