Target
Delta-type opioid receptor
Ligand
BDBM50080470
Substrate
Meas. Tech.
ChEMBL_147191 (CHEMBL759364)
Ki
125±n/a nM
Citation
 Ananthan, SKezar, HSCarter, RLSaini, SKRice, KCWells, JLDavis, PXu, HDersch, CMBilsky, EJPorreca, FRothman, RB Synthesis, opioid receptor binding, and biological activities of naltrexone-derived pyrido- and pyrimidomorphinans. J Med Chem 42:3527-38 (1999)  
Target
Name:
Delta-type opioid receptor
Synonyms:
Cytochrome P450 3A4 Delta opioid receptor Delta-type opioid receptor (DOR) OPRD_RAT Opioid receptor Opioid receptors; mu & delta Ror-a | Voltage-gated potassium channel
Type:
G Protein-Coupled Receptor (GPCR)
Mol. Mass.:
40465.04
Organism:
Rattus norvegicus (rat)
Description:
Competition binding assays were using CHO-K1 cell membranes expressing the opioid receptor.
Residue:
372
  
Inhibitor
Name:
BDBM50080470
Synonyms:
17-(Cyclopropyl-methyl) -6, 7-didehydro-3,14-dihydroxy-4,5alpha-epoxy-6'-methyl-4'-phenylpyrido-[2',3':6,7]morphinan | CHEMBL118487
Type:
Small organic molecule
Emp. Form.:
C30H30N2O3
Mol. Mass.:
466.5708
SMILES:
Cc1cc(-c2ccccc2)c2C[C@@]3(O)[C@H]4Cc5ccc(O)c6OC(c2n1)[C@]3(CCN4CC1CC1)c56
: