Target
Neuraminidase
Ligand
BDBM50083319
Substrate
Meas. Tech.
ChEMBL_144589 (CHEMBL749506)
Ki
1570±n/a nM
Citation
 Wall, IDLeach, ARSalt, DWFord, MGEssex, JW Binding constants of neuraminidase inhibitors: An investigation of the linear interaction energy method. J Med Chem 42:5142-52 (2000)  
Target
Name:
Neuraminidase
Synonyms:
Influenza A Virus Neuraminidase NRAM_I34A1 Neuraminidase A
Type:
Enzyme
Mol. Mass.:
50124.14
Organism:
Influenza A virus (A/Puerto Rico/8/34/Mount Sinai(H1N1))
Description:
P03468
Residue:
454
  
Inhibitor
Name:
BDBM50083319
Synonyms:
3-Acetylamino-6-dihydroxymethyl-2-phenethylcarbamoyl-3,4-dihydro-2H-pyran-4-yl-ammonium
Type:
Small organic molecule
Emp. Form.:
C17H24N3O5
Mol. Mass.:
350.389
SMILES:
CC(=O)N[C@@H]1[C@@H]([NH3+])C=C(O[C@H]1C(=O)NCCc1ccccc1)C(O)O
: