Target
Corticotropin-releasing factor receptor 1
Ligand
BDBM50084878
Substrate
Meas. Tech.
ChEMBL_50978 (CHEMBL663521)
Ki
0.4±n/a nM
Citation
 He, LGilligan, PJZaczek, RFitzgerald, LWMcElroy, JShen, HSSaye, JAKalin, NHShelton, SChrist, DTrainor, GHartig, P 4-(1,3-Dimethoxyprop-2-ylamino)-2,7-dimethyl-8-(2, 4-dichlorophenyl)pyrazolo[1,5-a]-1,3,5-triazine: a potent, orally bioavailable CRF(1) receptor antagonist. J Med Chem 43:449-56 (2000)  
Target
Name:
Corticotropin-releasing factor receptor 1
Synonyms:
CRF-R CRF1 CRFR1 CRH-R 1 CRHR1 Corticotropin-releasing factor receptor 1 (CRF-1) Corticotropin-releasing hormone receptor 1
Type:
Enzyme
Mol. Mass.:
50744.31
Organism:
Homo sapiens (Human)
Description:
P34998
Residue:
444
  
Inhibitor
Name:
BDBM50084878
Synonyms:
Butyl-[8-(2,4-dichloro-phenyl)-2,7-dimethyl-pyrazolo[1,5-a][1,3,5]triazin-4-yl]-ethyl-amine | CHEMBL341820
Type:
Small organic molecule
Emp. Form.:
C19H23Cl2N5
Mol. Mass.:
392.325
SMILES:
CCCCN(CC)c1nc(C)nc2c(c(C)nn12)-c1ccc(Cl)cc1Cl
: