Target
Corticotropin-releasing factor receptor 2
Ligand
BDBM50087711
Substrate
Meas. Tech.
ChEMBL_220717 (CHEMBL843662)
EC50
1.4±n/a nM
Citation
 Gilligan, PJRobertson, DWZaczek, R Corticotropin releasing factor (CRF) receptor modulators: progress and opportunities for new therapeutic agents. J Med Chem 43:1641-60 (2000)  
Target
Name:
Corticotropin-releasing factor receptor 2
Synonyms:
CRF-R 2 CRF2R CRH-R 2 CRHR2 Corticotropin-releasing factor receptor 2 (CRF-2) Corticotropin-releasing hormone receptor 2
Type:
Enzyme
Mol. Mass.:
47694.70
Organism:
Homo sapiens (Human)
Description:
Q13324
Residue:
411
  
Inhibitor
Name:
BDBM50087711
Synonyms:
CHEMBL429560 | Sauvagine-frog(QGPPISIDLSLELLRKMIEIEKQEKQQAANNRLLLDTI-NH2)
Type:
Small organic molecule
Emp. Form.:
C202H349N57O63S
Mol. Mass.:
4616.342
SMILES:
CC[C@H](C)[C@H](NC(=O)[C@@H](NC(=O)[C@H](CC(O)=O)NC(=O)[C@H](CC(C)C)NC(=O)[C@H](CC(C)C)NC(=O)[C@H](CC(C)C)NC(=O)[C@H](CCCNC(N)=N)NC(=O)[C@H](CC(N)=O)NC(=O)[C@H](CC(N)=O)NC(=O)[C@H](C)NC(=O)[C@H](C)NC(=O)[C@H](CCC(N)=O)NC(=O)[C@H](CCC(N)=O)NC(=O)[C@H](CCCCN)NC(=O)[C@H](CCC(O)=O)NC(=O)[C@H](CCCCN)NC(=O)[C@H](CCC(O)=O)NC(=O)[C@H](CCC(N)=O)NC(=O)[C@H](CCCCN)NC(=O)[C@H](CCC(O)=O)NC(=O)[C@@H](NC(=O)[C@H](CCC(O)=O)NC(=O)[C@@H](NC(=O)[C@H](CCSC)NC(=O)[C@H](CCCCN)NC(=O)[C@H](CCCNC(N)=N)NC(=O)[C@H](CC(C)C)NC(=O)[C@H](CC(C)C)NC(=O)[C@H](CCC(O)=O)NC(=O)[C@H](CC(C)C)NC(=O)[C@H](CO)NC(=O)[C@H](CC(C)C)NC(=O)[C@H](CC(O)=O)NC(=O)[C@@H](NC(=O)[C@H](CO)NC(=O)[C@@H](NC(=O)[C@@H]1CCCN1C(=O)[C@H]1CCCN1C(=O)CNC(=O)[C@@H](N)CCC(N)=O)[C@@H](C)CC)[C@@H](C)CC)[C@@H](C)CC)[C@@H](C)CC)[C@@H](C)O)C(N)=O
: