Target
Coagulation factor X
Ligand
BDBM50087533
Substrate
Meas. Tech.
ChEMBL_48791 (CHEMBL662444)
Ki
0.15±n/a nM
Citation
 Pinto, DJOrwat, MJWang, SFevig, JMQuan, MLAmparo, ECacciola, JRossi, KAAlexander, RSSmallwood, AMLuettgen, JMLiang, LAungst, BJWright, MRKnabb, RMWong, PCWexler, RRLam, PY Discovery of 1-[3-(aminomethyl)phenyl]-N-3-fluoro-2'-(methylsulfonyl)-[1,1'-biphenyl]-4-yl]-3-(trifluoromethyl)-1H-pyrazole-5-carboxamide (DPC423), a highly potent, selective, and orally bioavailable inhibitor of blood coagulation factor Xa. J Med Chem 44:566-78 (2001)  
Target
Name:
Coagulation factor X
Synonyms:
Activated coagulation factor X (FXa) Coagulation factor X precursor F10 Factor X heavy chain Factor Xa Stuart-Prower factor
Type:
Enzyme
Mol. Mass.:
54726.60
Organism:
Homo sapiens (Human)
Description:
Residue:
488
  
Inhibitor
Name:
BDBM50087533
Synonyms:
3-(3-Carbamimidoyl-phenyl)-isoxazole-4-carboxylic acid (2'-sulfamoyl-biphenyl-4-yl)-amide CHEMBL153611
Type:
Small organic molecule
Emp. Form.:
C23H19N5O4S
Mol. Mass.:
461.493
SMILES:
NC(=N)c1cccc(c1)-c1nocc1C(=O)Nc1ccc(cc1)-c1ccccc1S(N)(=O)=O
: