Target
Mast cell carboxypeptidase A
Ligand
BDBM50121917
Substrate
Meas. Tech.
ChEMBL_45636 (CHEMBL655446)
Ki
5000±n/a nM
Citation
 Patchett, AA 2002 Alfred Burger Award Address in Medicinal Chemistry. Natural products and design: interrelated approaches in drug discovery. J Med Chem 45:5609-16 (2002)  
Target
Name:
Mast cell carboxypeptidase A
Synonyms:
CBPA3_HUMAN Carboxypeptidase A3 | MC-CPA
Type:
PROTEIN
Mol. Mass.:
48684.88
Organism:
Homo sapiens (Human)
Description:
ChEMBL_45634
Residue:
417
  
Inhibitor
Name:
BDBM50121917
Synonyms:
2-Benzyl-pentanedioic acid | CHEMBL153232
Type:
Small organic molecule
Emp. Form.:
C12H14O4
Mol. Mass.:
222.2372
SMILES:
OC(=O)CCC(Cc1ccccc1)C(O)=O
: