Target
D(3) dopamine receptor
Ligand
BDBM50122028
Substrate
Meas. Tech.
ChEMBL_62757 (CHEMBL676126)
Ki
>850±n/a nM
Citation
 Leopoldo, MBerardi, FColabufo, NADe Giorgio, PLacivita, EPerrone, RTortorella, V Structure-affinity relationship study on N-[4-(4-arylpiperazin-1-yl)butyl]arylcarboxamides as potent and selective dopamine D(3) receptor ligands. J Med Chem 45:5727-35 (2002)  
Target
Name:
D(3) dopamine receptor
Synonyms:
DOPAMINE D3 Dopamine D3 receptor | Drd3
Type:
Protein
Mol. Mass.:
49540.58
Organism:
Rattus norvegicus (Rat)
Description:
P19020
Residue:
446
  
Inhibitor
Name:
BDBM50122028
Synonyms:
3-Methoxy-N-[2-(4-p-tolyl-piperazin-1-yl)-ethyl]-benzamide | CHEMBL156845
Type:
Small organic molecule
Emp. Form.:
C21H27N3O2
Mol. Mass.:
353.458
SMILES:
COc1cccc(c1)C(=O)NCCN1CCN(CC1)c1ccc(C)cc1
: