Target
Poly [ADP-ribose] polymerase 1
Ligand
BDBM50130573
Substrate
Meas. Tech.
ChEMBL_159656 (CHEMBL761610)
IC50
112±n/a nM
Citation
 Ferraris, DKo, YSPahutski, TFicco, RPSerdyuk, LAlemu, CBradford, CChiou, THoover, RHuang, SLautar, SLiang, SLin, QLu, MXMooney, MMorgan, LQian, YTran, SWilliams, LRWu, QYZhang, JZou, YKalish, V Design and synthesis of poly ADP-ribose polymerase-1 inhibitors. 2. Biological evaluation of aza-5[H]-phenanthridin-6-ones as potent, aqueous-soluble compounds for the treatment of ischemic injuries. J Med Chem 46:3138-51 (2003)  
Target
Name:
Poly [ADP-ribose] polymerase 1
Synonyms:
(ARTD1 or PARP1) 2.4.2.30 ADPRT ARTD1 Human diphtheria toxin-like ADP-ribosyltransferase (ARTD1 or PARP1) NT-PARP-1 PARP1 PPOL Poly [ADP-ribose] polymerase 1 (PARP) Poly [ADP-ribose] polymerase 1 (PARP1) Poly [ADP-ribose] polymerase 1, 28-kDa form Poly [ADP-ribose] polymerase 1, processed C-terminus Poly [ADP-ribose] polymerase-1 Poly(ADP-ribose) polymerase-1 (ARTD1/PARP1) Protein poly-ADP-ribosyltransferase PARP1 | Synonyms=ADPRT
Type:
Mol. Mass.:
113114.22
Organism:
Homo sapiens (Human)
Description:
P09874
Residue:
1014
  
Inhibitor
Name:
BDBM50130573
Synonyms:
2-(4-Dimethylamino-piperidin-1-yl)-5H-benzo[c][1,5]naphthyridin-6-one; compound with methanesulfonic acid | CHEMBL418813
Type:
Small organic molecule
Emp. Form.:
C19H22N4O
Mol. Mass.:
322.4042
SMILES:
CN(C)C1CCN(CC1)c1ccc2[nH]c(=O)c3ccccc3c2n1
: