Target
5-hydroxytryptamine receptor 3A/3B/3C/3D/3E
Ligand
BDBM50005836
Substrate
Meas. Tech.
ChEMBL_3442 (CHEMBL618127)
Ki
152±n/a nM
Citation
 Langlois, MFischmeister, R 5-HT4 receptor ligands: applications and new prospects. J Med Chem 46:319-44 (2003)  
Target
Name:
5-hydroxytryptamine receptor 3A/3B/3C/3D/3E
Synonyms:
Serotonin 3 (5-HT3) receptor | Serotonin 3a (5-HT3a)/3b (5-HT3b)/3c (5-HT3c)/3d (5-HT3d)/3e (5-HT3e) receptor
Type:
Mol. Mass.:
Description:
ASSAY_ID of EBI is 3422
Components:
This complex has 5 components.
Component 1
Name:
5-hydroxytryptamine receptor 3A
Synonyms:
5-HT-3 5-HT3A 5-hydroxytryptamine receptor 3 (5-HT3) 5-hydroxytryptamine receptor 3A (5HT3A) 5HT3R HTR3A Serotonin 3 receptor (5HT3) Serotonin-gated ion channel receptor | Serotonin-gated ion channel receptor 3
Type:
Protein
Mol. Mass.:
55283.27
Organism:
Homo sapiens (Human)
Description:
P46098
Residue:
478
  
Component 2
Name:
5-hydroxytryptamine receptor 3B
Synonyms:
5-HT-3B 5-hydroxytryptamine receptor 3B HTR3B Serotonin receptor 3B
Type:
PROTEIN
Mol. Mass.:
50281.60
Organism:
Homo sapiens (Human)
Description:
EBI_11305
Residue:
441
  
Component 3
Name:
5-hydroxytryptamine receptor 3C
Synonyms:
5HT3C_HUMAN Serotonin (5-HT3) receptor
Type:
PROTEIN
Mol. Mass.:
50216.00
Organism:
Homo sapiens (Human)
Description:
EBI_12117
Residue:
447
  
Component 4
Name:
5-hydroxytryptamine receptor 3D
Synonyms:
5HT3D_HUMAN Serotonin (5-HT3) receptor
Type:
PROTEIN
Mol. Mass.:
50209.16
Organism:
Homo sapiens (Human)
Description:
EBI_12960
Residue:
454
  
Component 5
Name:
5-hydroxytryptamine receptor 3E
Synonyms:
5HT3E_HUMAN Serotonin (5-HT3) receptor
Type:
PROTEIN
Mol. Mass.:
51440.34
Organism:
Homo sapiens (Human)
Description:
EBI_14002
Residue:
456
  
Inhibitor
Name:
BDBM50005836
Synonyms:
4-Amino-5-chloro-N-{1-[3-(4-fluoro-phenoxy)-propyl]-3-methoxy-piperidin-4-yl}-2-methoxy-benzamide CHEMBL560739 PROPULSID US10800776, Example Cisapride cid_5311047
Type:
Small organic molecule
Emp. Form.:
C23H29ClFN3O4
Mol. Mass.:
465.945
SMILES:
COC1CN(CCCOc2ccc(F)cc2)CCC1NC(=O)c1cc(Cl)c(N)cc1OC
: