Target
Adenosylhomocysteinase
Ligand
BDBM84862
Substrate
Meas. Tech.
ChEMBL_303030 (CHEMBL830417)
Ki
4000±n/a nM
Citation
 Guillerm, GMuzard, MGlapski, CPilard, S Inactivation of human S-adenosylhomocysteine hydrolase by covalent labeling of cysteine 195 with thionucleoside derivatives. Bioorg Med Chem Lett 14:5803-7 (2004)  
Target
Name:
Adenosylhomocysteinase
Synonyms:
AHCY SAHH | SAHH_HUMAN
Type:
PROTEIN
Mol. Mass.:
47714.06
Organism:
Homo sapiens (Human)
Description:
ChEMBL_1507791
Residue:
432
  
Inhibitor
Name:
BDBM84862
Synonyms:
5'-Deoxy-5'-thiodenosine scaffold, 6
Type:
Small organic molecule
Emp. Form.:
C10H13N5O3S
Mol. Mass.:
283.307
SMILES:
Nc1ncnc2n(cnc12)[C@@H]1O[C@H](CS)[C@@H](O)[C@H]1O
: