Target
Neuronal acetylcholine receptor subunit alpha-4/beta-2
Ligand
BDBM50167468
Substrate
Meas. Tech.
ChEMBL_303488 (CHEMBL838862)
Ki
13±n/a nM
Citation
 Coe, JWVetelino, MGBashore, CGWirtz, MCBrooks, PRArnold, EPLebel, LAFox, CBSands, SBDavis, TISchulz, DWRollema, HTingley, FDO'Neill, BT In pursuit of alpha4beta2 nicotinic receptor partial agonists for smoking cessation: carbon analogs of (-)-cytisine. Bioorg Med Chem Lett 15:2974-9 (2005)  
Target
Name:
Neuronal acetylcholine receptor subunit alpha-4/beta-2
Synonyms:
Neuronal acetylcholine receptor Alpha-4/Beta-2 Neuronal acetylcholine receptor; alpha4/beta2 | nAChR subtypes alpha4 beta2
Type:
Protein
Mol. Mass.:
Description:
Components:
This complex has 2 components.
Component 1
Name:
Neuronal acetylcholine receptor subunit alpha-4
Synonyms:
ACHA4_HUMAN CHRNA4 protein Neuronal acetylcholine receptor protein alpha-4 subunit Nicotinic acetylcholine receptor alpha4/beta2/alpha5
Type:
Mol. Mass.:
69963.49
Organism:
Homo sapiens (Human)
Description:
NACHRA4
Residue:
627
  
Component 2
Name:
Neuronal acetylcholine receptor subunit beta-2
Synonyms:
ACHB2_HUMAN Neuronal acetylcholine receptor protein beta-2 subunit | Nicotinic acetylcholine receptor alpha3/beta2/alpha5
Type:
Protein
Mol. Mass.:
57020.50
Organism:
Homo sapiens (Human)
Description:
P17787
Residue:
502
  
Inhibitor
Name:
BDBM50167468
Synonyms:
5-Ethoxy-11-aza-tricyclo[7.3.1.0*2,7*]trideca-2,4,6-triene | CHEMBL264986
Type:
Small organic molecule
Emp. Form.:
C14H19NO
Mol. Mass.:
217.3068
SMILES:
CCOc1ccc2C3CNCC(C3)Cc2c1
: