Target
Adenosine receptor A2a
Ligand
BDBM50150764
Substrate
Meas. Tech.
ChEMBL_310583 (CHEMBL834239)
EC50
3.1±n/a nM
Citation
 Bosch, MPCampos, FNiubó, IRosell, GDíaz, JLBrea, JLoza, MIGuerrero, A Synthesis and biological activity of new potential agonists for the human adenosine A2A receptor. J Med Chem 47:4041-53 (2004)  
Target
Name:
Adenosine receptor A2a
Synonyms:
A2A adenosine receptor (hA2A) ADENOSINE A2 ADORA2 Adenosine A2A receptor (A2AAR)
Type:
G Protein-Coupled Receptor (GPCR)
Mol. Mass.:
44716.46
Organism:
Homo sapiens (Human)
Description:
P29274
Residue:
412
  
Inhibitor
Name:
BDBM50150764
Synonyms:
(2R,3R,4S,5R)-2-{6-Amino-2-[(S)-1-hydroxymethyl-2-(4-nitro-phenyl)-ethylamino]-purin-9-yl}-5-(2-ethyl-2H-tetrazol-5-yl)-tetrahydro-furan-3,4-diol | CHEMBL186403
Type:
Small organic molecule
Emp. Form.:
C21H25N11O6
Mol. Mass.:
527.4933
SMILES:
CCn1nnc(n1)[C@H]1O[C@H]([C@H](O)[C@@H]1O)n1cnc2c(N)nc(N[C@H](CO)Cc3ccc(cc3)[N+]([O-])=O)nc12
: