Target
Cytochrome P450 2A6
Ligand
BDBM12358
Substrate
Meas. Tech.
ChEMBL_305739 (CHEMBL829411)
IC50
1500±n/a nM
Citation
 Denton, TTZhang, XCashman, JR 5-substituted, 6-substituted, and unsubstituted 3-heteroaromatic pyridine analogues of nicotine as selective inhibitors of cytochrome P-450 2A6. J Med Chem 48:224-39 (2005)  
Target
Name:
Cytochrome P450 2A6
Synonyms:
1,4-cineole 2-exo-monooxygenase CP2A6_HUMAN CYP2A6 Coumarin 7-hydroxylase Cytochrome P450 IIA3 | Cytochrome P450(I)
Type:
Protein
Mol. Mass.:
56514.34
Organism:
Homo sapiens (Human)
Description:
P11509
Residue:
494
  
Inhibitor
Name:
BDBM12358
Synonyms:
3-(4-methylthiophen-3-yl)pyridine US8609708, 17 nicotine 3-heteroaromatic analogue 11
Type:
Small organic molecule
Emp. Form.:
C10H9NS
Mol. Mass.:
175.25
SMILES:
Cc1cscc1-c1cccnc1
: