Target
Cytochrome P450 2E1
Ligand
BDBM12358
Substrate
Meas. Tech.
ChEMBL_305743 (CHEMBL829415)
IC50
6300±n/a nM
Citation
 Denton, TTZhang, XCashman, JR 5-substituted, 6-substituted, and unsubstituted 3-heteroaromatic pyridine analogues of nicotine as selective inhibitors of cytochrome P-450 2A6. J Med Chem 48:224-39 (2005)  
Target
Name:
Cytochrome P450 2E1
Synonyms:
CP2E1_HUMAN CYP2E1 | Cytochrome P450 2E1 (CYP2E1)
Type:
Enzyme
Mol. Mass.:
56860.34
Organism:
Homo sapiens (Human)
Description:
P05181
Residue:
493
  
Inhibitor
Name:
BDBM12358
Synonyms:
3-(4-methylthiophen-3-yl)pyridine US8609708, 17 nicotine 3-heteroaromatic analogue 11
Type:
Small organic molecule
Emp. Form.:
C10H9NS
Mol. Mass.:
175.25
SMILES:
Cc1cscc1-c1cccnc1
: