Target
Cytochrome P450 2C19
Ligand
BDBM12358
Substrate
Meas. Tech.
ChEMBL_305767 (CHEMBL827104)
IC50
24900±n/a nM
Citation
 Denton, TTZhang, XCashman, JR 5-substituted, 6-substituted, and unsubstituted 3-heteroaromatic pyridine analogues of nicotine as selective inhibitors of cytochrome P-450 2A6. J Med Chem 48:224-39 (2005)  
Target
Name:
Cytochrome P450 2C19
Synonyms:
(R)-limonene 6-monooxygenase (S)-limonene 7-monooxygenase CYP2C19 CYPIIC19 Cytochrome P450 2C19 [I331V] Cytochrome P450-254C Mephenytoin 4-hydroxylase P450-254C
Type:
Enzyme
Mol. Mass.:
55935.47
Organism:
Homo sapiens (Human)
Description:
P33261
Residue:
490
  
Inhibitor
Name:
BDBM12358
Synonyms:
3-(4-methylthiophen-3-yl)pyridine US8609708, 17 nicotine 3-heteroaromatic analogue 11
Type:
Small organic molecule
Emp. Form.:
C10H9NS
Mol. Mass.:
175.25
SMILES:
Cc1cscc1-c1cccnc1
: