Target
Cytochrome P450 2B6
Ligand
BDBM12358
Substrate
Meas. Tech.
ChEMBL_305740 (CHEMBL829412)
IC50
6300±n/a nM
Citation
 Denton, TTZhang, XCashman, JR 5-substituted, 6-substituted, and unsubstituted 3-heteroaromatic pyridine analogues of nicotine as selective inhibitors of cytochrome P-450 2A6. J Med Chem 48:224-39 (2005)  
Target
Name:
Cytochrome P450 2B6
Synonyms:
CP2B6_HUMAN Cytochrome P450 2B6 (CYP2B6)
Type:
Protein
Mol. Mass.:
56289.75
Organism:
Homo sapiens (Human)
Description:
P20813
Residue:
491
  
Inhibitor
Name:
BDBM12358
Synonyms:
3-(4-methylthiophen-3-yl)pyridine US8609708, 17 nicotine 3-heteroaromatic analogue 11
Type:
Small organic molecule
Emp. Form.:
C10H9NS
Mol. Mass.:
175.25
SMILES:
Cc1cscc1-c1cccnc1
: