Target
Complement C3
Ligand
BDBM50159036
Substrate
Meas. Tech.
ChEMBL_305250 (CHEMBL833507)
IC50
>1000000±n/a nM
Citation
 Mallik, BKatragadda, MSpruce, LACarafides, CTsokos, CGMorikis, DLambris, JD Design and NMR characterization of active analogues of compstatin containing non-natural amino acids. J Med Chem 48:274-86 (2005)  
Target
Name:
Complement C3
Synonyms:
C3 CPAMD1
Type:
Enzyme
Mol. Mass.:
187142.34
Organism:
Homo sapiens (Human)
Description:
P01024
Residue:
1663
  
Inhibitor
Name:
BDBM50159036
Synonyms:
Ac-I[CVWQDWGAHdRC]T | CHEMBL410971
Type:
Small organic molecule
Emp. Form.:
C69H98N22O17S2
Mol. Mass.:
1571.784
SMILES:
CC[C@H](C)[C@H](N)C(=O)N[C@H]1CSSC[C@H](NC(=O)[C@@H](CCCNC(N)=N)NC(=O)[C@@H](Cc2cnc[nH]2)NC(=O)[C@H](C)NC(=O)CNC(=O)[C@H](Cc2c[nH]c3ccccc23)NC(=O)[C@@H](CC(O)=O)NC(=O)[C@H](CCC(N)=O)NC(=O)[C@@H](Cc2c[nH]c3ccccc23)NC(=O)[C@@H](NC1=O)C(C)C)C(=O)N[C@@H]([C@@H](C)O)C(N)=O
: