Target
Complement C3
Ligand
BDBM50159042
Substrate
Meas. Tech.
ChEMBL_305250 (CHEMBL833507)
IC50
>1000000±n/a nM
Citation
 Mallik, BKatragadda, MSpruce, LACarafides, CTsokos, CGMorikis, DLambris, JD Design and NMR characterization of active analogues of compstatin containing non-natural amino acids. J Med Chem 48:274-86 (2005)  
Target
Name:
Complement C3
Synonyms:
C3 CPAMD1
Type:
Enzyme
Mol. Mass.:
187142.34
Organism:
Homo sapiens (Human)
Description:
P01024
Residue:
1663
  
Inhibitor
Name:
BDBM50159042
Synonyms:
Ac-I[CVVQdDWGHHRC]-NH2 | CHEMBL273856
Type:
Small organic molecule
Emp. Form.:
C68H99N23O19S2
Mol. Mass.:
1606.786
SMILES:
CC[C@H](C)[C@H](NC(C)=O)C(=O)N[C@H]1CSSC[C@@H](NC(=O)[C@@H](CCCNC(N)=N)NC(=O)[C@H](Cc2cnc[nH]2)NC(=O)[C@@H](Cc2cnc[nH]2)NC(=O)CNC(=O)[C@@H](Cc2c[nH]c3ccccc23)NC(=O)[C@H](CC(O)=O)NC(=O)[C@H](CC(O)=O)NC(=O)[C@H](CCC(N)=O)NC(=O)[C@H](NC(=O)[C@@H](NC1=O)C(C)C)C(C)C)C(N)=O
: