Target
High affinity cAMP-specific 3',5'-cyclic phosphodiesterase 7A/cAMP-specific 3',5'-cyclic phosphodiesterase 7B
Ligand
BDBM50027176
Substrate
Meas. Tech.
ChEMBL_302392 (CHEMBL875201)
Ki
4000±n/a nM
Citation
 Manallack, DTHughes, RAThompson, PE The next generation of phosphodiesterase inhibitors: structural clues to ligand and substrate selectivity of phosphodiesterases. J Med Chem 48:3449-62 (2005)  
Target
Name:
High affinity cAMP-specific 3',5'-cyclic phosphodiesterase 7A/cAMP-specific 3',5'-cyclic phosphodiesterase 7B
Synonyms:
Phosphodiesterase 7
Type:
Mol. Mass.:
Description:
ASSAY_ID of ChEMBL is 302392
Components:
This complex has 2 components.
Component 1
Name:
cAMP-specific 3',5'-cyclic phosphodiesterase 7B
Synonyms:
3',5'-cyclic phosphodiesterase PDE7B_HUMAN Phosphodiesterase 7B (PDE7B) | cAMP-specific 3',5'-cyclic phosphodiesterase 7B
Type:
Enzyme
Mol. Mass.:
51842.76
Organism:
Homo sapiens (Human)
Description:
Q9NP56
Residue:
450
  
Component 2
Name:
High affinity cAMP-specific 3',5'-cyclic phosphodiesterase 7A
Synonyms:
3',5'-cyclic phosphodiesterase PDE7A_HUMAN Phosphodiesterase 7 (PDE7) Phosphodiesterase 7A (PDE7A1)
Type:
Enzyme
Mol. Mass.:
55514.96
Organism:
Homo sapiens (Human)
Description:
Q13946
Residue:
482
  
Inhibitor
Name:
BDBM50027176
Synonyms:
2-Acetoxy-Benzoic Acid CHEBI:34795 | ISOBUTYLMETHYLXANTHINE
Type:
Small organic molecule
Emp. Form.:
C10H14N4O2
Mol. Mass.:
222.2438
SMILES:
CC(C)Cn1c2[nH]cnc2c(=O)n(C)c1=O
: