Target
Serine protease 1/Trypsin-2
Ligand
BDBM50068488
Substrate
Meas. Tech.
ChEMBL_302282 (CHEMBL830300)
Ki
620±n/a nM
Citation
 Ueno, HYokota, KHoshi, JYasue, KHayashi, MHase, YUchida, IAisaka, KKatoh, SCho, H Synthesis and structure-activity relationships of novel selective factor Xa inhibitors with a tetrahydroisoquinoline ring. J Med Chem 48:3586-604 (2005)  
Target
Name:
Serine protease 1/Trypsin-2
Synonyms:
Trypsin II
Type:
Mol. Mass.:
Description:
ASSAY_ID of EBI is 212335
Components:
This complex has 2 components.
Component 1
Name:
Serine protease 1
Synonyms:
Alpha-trypsin chain 1 Beta-trypsin PRSS1 TRP1 TRY1_HUMAN Thrombin & trypsin Trypsin I | Trypsin-1
Type:
Enzyme
Mol. Mass.:
26557.80
Organism:
Homo sapiens (Human)
Description:
P07477
Residue:
247
  
Component 2
Name:
Trypsin-2
Synonyms:
Anionic trypsinogen Serine protease 2 TRY2_HUMAN Thrombin & trypsin Trypsin II | Trypsin-2
Type:
PROTEIN
Mol. Mass.:
26479.43
Organism:
Homo sapiens (Human)
Description:
ChEMBL_41517
Residue:
247
  
Inhibitor
Name:
BDBM50068488
Synonyms:
(S)-3-(7-Carbamimidoyl-naphthalen-2-yl)-2-{4-[(S)-1-(1-imino-ethyl)-pyrrolidin-3-yloxy]-phenyl}-propionic acid; hydrochloride | CHEMBL539053
Type:
Small organic molecule
Emp. Form.:
C26H28N4O3
Mol. Mass.:
444.5255
SMILES:
CC(=N)N1CC[C@@H](C1)Oc1ccc(cc1)[C@H](Cc1ccc2ccc(cc2c1)C(N)=N)C(O)=O
: