Target
Prothrombin
Ligand
BDBM50167027
Substrate
Meas. Tech.
ChEMBL_304926 (CHEMBL877331)
IC50
>10000±n/a nM
Citation
 Ueno, HYokota, KHoshi, JYasue, KHayashi, MHase, YUchida, IAisaka, KKatoh, SCho, H Synthesis and structure-activity relationships of novel selective factor Xa inhibitors with a tetrahydroisoquinoline ring. J Med Chem 48:3586-604 (2005)  
Target
Name:
Prothrombin
Synonyms:
Activation peptide fragment 1 Coagulation factor II Prothrombin precursor Thrombin heavy chain | Thrombin light chain
Type:
Protein
Mol. Mass.:
70029.57
Organism:
Homo sapiens (Human)
Description:
P00734
Residue:
622
  
Inhibitor
Name:
BDBM50167027
Synonyms:
4-(2-Carbamimidoyl-1,2,3,4-tetrahydro-isoquinolin-7-yloxymethyl)-4-ethoxycarbonyl-1'-methyl-3,4,5,6-tetrahydro-2H-[1,4']bipyridinyl-1'-ium; chloride | CHEMBL195901
Type:
Small organic molecule
Emp. Form.:
C25H34N5O3
Mol. Mass.:
452.5686
SMILES:
CCOC(=O)C1(COc2ccc3CCN(Cc3c2)C(N)=N)CC[N+](CC1)=c1ccn(C)cc1
: