Target
Prothrombin
Ligand
BDBM50157338
Substrate
Meas. Tech.
ChEMBL_304926 (CHEMBL877331)
IC50
>10000±n/a nM
Citation
 Ueno, HYokota, KHoshi, JYasue, KHayashi, MHase, YUchida, IAisaka, KKatoh, SCho, H Synthesis and structure-activity relationships of novel selective factor Xa inhibitors with a tetrahydroisoquinoline ring. J Med Chem 48:3586-604 (2005)  
Target
Name:
Prothrombin
Synonyms:
Activation peptide fragment 1 Coagulation factor II Prothrombin precursor Thrombin heavy chain | Thrombin light chain
Type:
Protein
Mol. Mass.:
70029.57
Organism:
Homo sapiens (Human)
Description:
P00734
Residue:
622
  
Inhibitor
Name:
BDBM50157338
Synonyms:
4-(2-Carbamimidoyl-1,2,3,4-tetrahydro-isoquinolin-7-yloxymethyl)-3,4,5,6-tetrahydro-2H-[1,4'']bipyridinyl-3''-carboxylic acid methyl ester; di hydrochloride CHEMBL535369
Type:
Small organic molecule
Emp. Form.:
C23H29N5O3
Mol. Mass.:
423.5081
SMILES:
COC(=O)c1cnccc1N1CCC(COc2ccc3CCN(Cc3c2)C(N)=N)CC1
: