Target
Coagulation factor X
Ligand
BDBM50157339
Substrate
Meas. Tech.
ChEMBL_302340 (CHEMBL828924)
Ki
19±n/a nM
Citation
 Ueno, HYokota, KHoshi, JYasue, KHayashi, MHase, YUchida, IAisaka, KKatoh, SCho, H Synthesis and structure-activity relationships of novel selective factor Xa inhibitors with a tetrahydroisoquinoline ring. J Med Chem 48:3586-604 (2005)  
Target
Name:
Coagulation factor X
Synonyms:
Activated coagulation factor X (FXa) Coagulation factor X precursor F10 Factor X heavy chain Factor Xa Stuart-Prower factor
Type:
Enzyme
Mol. Mass.:
54726.60
Organism:
Homo sapiens (Human)
Description:
Residue:
488
  
Inhibitor
Name:
BDBM50157339
Synonyms:
4-(2-Carbamimidoyl-1,2,3,4-tetrahydro-isoquinolin-7-yloxymethyl)-1-pyrimidin-4-yl-piperidine-4-carboxylic acid; dihydrochloride CHEMBL534707
Type:
Small organic molecule
Emp. Form.:
C21H26N6O3
Mol. Mass.:
410.4695
SMILES:
NC(=N)N1CCc2ccc(OCC3(CCN(CC3)c3ccncn3)C(O)=O)cc2C1
: