Target
Prothrombin
Ligand
BDBM50157327
Substrate
Meas. Tech.
ChEMBL_304926 (CHEMBL877331)
IC50
>10000±n/a nM
Citation
 Ueno, HYokota, KHoshi, JYasue, KHayashi, MHase, YUchida, IAisaka, KKatoh, SCho, H Synthesis and structure-activity relationships of novel selective factor Xa inhibitors with a tetrahydroisoquinoline ring. J Med Chem 48:3586-604 (2005)  
Target
Name:
Prothrombin
Synonyms:
Activation peptide fragment 1 Coagulation factor II Prothrombin precursor Thrombin heavy chain | Thrombin light chain
Type:
Protein
Mol. Mass.:
70029.57
Organism:
Homo sapiens (Human)
Description:
P00734
Residue:
622
  
Inhibitor
Name:
BDBM50157327
Synonyms:
7-[1-(1-Imino-ethyl)-piperidin-4-ylmethoxy]-3,4-dihydro-1H-isoquinoline-2-carboxamidine; di hydrochloride CHEMBL535595
Type:
Small organic molecule
Emp. Form.:
C18H27N5O
Mol. Mass.:
329.4399
SMILES:
CC(=N)N1CCC(COc2ccc3CCN(Cc3c2)C(N)=N)CC1
: