Target
Coagulation factor X
Ligand
BDBM50167027
Substrate
Meas. Tech.
ChEMBL_304697 (CHEMBL827049)
IC50
1130±n/a nM
Citation
 Ueno, HYokota, KHoshi, JYasue, KHayashi, MHase, YUchida, IAisaka, KKatoh, SCho, H Synthesis and structure-activity relationships of novel selective factor Xa inhibitors with a tetrahydroisoquinoline ring. J Med Chem 48:3586-604 (2005)  
Target
Name:
Coagulation factor X
Synonyms:
Activated coagulation factor X (FXa) Coagulation factor X precursor F10 Factor X heavy chain Factor Xa Stuart-Prower factor
Type:
Enzyme
Mol. Mass.:
54726.60
Organism:
Homo sapiens (Human)
Description:
Residue:
488
  
Inhibitor
Name:
BDBM50167027
Synonyms:
4-(2-Carbamimidoyl-1,2,3,4-tetrahydro-isoquinolin-7-yloxymethyl)-4-ethoxycarbonyl-1'-methyl-3,4,5,6-tetrahydro-2H-[1,4']bipyridinyl-1'-ium; chloride | CHEMBL195901
Type:
Small organic molecule
Emp. Form.:
C25H34N5O3
Mol. Mass.:
452.5686
SMILES:
CCOC(=O)C1(COc2ccc3CCN(Cc3c2)C(N)=N)CC[N+](CC1)=c1ccn(C)cc1
: