Target
D(3) dopamine receptor
Ligand
BDBM50161227
Substrate
Meas. Tech.
ChEMBL_312900 (CHEMBL827420)
IC50
4.79±n/a nM
Citation
 Newman, AHGrundt, PNader, MA Dopamine D3 receptor partial agonists and antagonists as potential drug abuse therapeutic agents. J Med Chem 48:3663-79 (2005)  
Target
Name:
D(3) dopamine receptor
Synonyms:
DOPAMINE D3 DRD3_HUMAN Dopamine D3 receptor (D3) Dopamine receptor Dopamine receptor D3
Type:
Mol. Mass.:
44243.43
Organism:
Homo sapiens (Human)
Description:
Residue:
400
  
Inhibitor
Name:
BDBM50161227
Synonyms:
CHEMBL370713 | N-{4-[4-(2,3-Dichloro-phenyl)-piperazin-1-yl]-but-2-enyl}-4-methoxy-benzamide
Type:
Small organic molecule
Emp. Form.:
C22H25Cl2N3O2
Mol. Mass.:
434.359
SMILES:
COc1ccc(cc1)C(=O)NC\C=C\CN1CCN(CC1)c1cccc(Cl)c1Cl
: