Target
Type-2 angiotensin II receptor
Ligand
BDBM50370375
Substrate
Meas. Tech.
ChEMBL_303241 (CHEMBL827206)
Ki
0.9±n/a nM
Citation
 Rosenström, USköld, CPlouffe, BBeaudry, HLindeberg, GBotros, MNyberg, FWolf, GKarlén, AGallo-Payet, NHallberg, A New selective AT2 receptor ligands encompassing a gamma-turn mimetic replacing the amino acid residues 4-5 of angiotensin II act as agonists. J Med Chem 48:4009-24 (2005)  
Target
Name:
Type-2 angiotensin II receptor
Synonyms:
AGTR2 AT2 Angiotensin II type 2 (AT-2) receptor Type-2 angiotensin II receptor
Type:
Enzyme Catalytic Domain
Mol. Mass.:
41201.61
Organism:
Homo sapiens (Human)
Description:
Angiotensin II, central 0 0::P50052
Residue:
363
  
Inhibitor
Name:
BDBM50370375
Synonyms:
CHEMBL268815
Type:
Small organic molecule
Emp. Form.:
C53H74N12O12
Mol. Mass.:
1071.2279
SMILES:
[#6]-[#6]-[#6@@H](-[#6])-[#6@H](-[#7]-[#6](=O)-[#6@H](-[#6]-c1ccc(-[#8])cc1)-[#7]-[#6](=O)-[#6@@H](-[#7]-[#6](=O)-[#6@H](-[#6]-[#6]-[#6]\[#7]=[#6](\[#7])-[#7])-[#7]-[#6](=O)-[#6@@H](-[#7])-[#6]-[#6](-[#8])=O)-[#6](-[#6])-[#6])-[#6](=O)-[#7]-[#6@@H](-[#6]-c1ccc(-[#7])cc1)-[#6](=O)-[#7]-1-[#6]-[#6]-[#6]-[#6@H]-1-[#6](=O)-[#7]-[#6@@H](-[#6]-c1ccccc1)-[#6](-[#8])=O
: