Target
Sigma non-opioid intracellular receptor 1
Ligand
BDBM50170652
Substrate
Meas. Tech.
ChEMBL_303441 (CHEMBL839610)
Ki
0.04±n/a nM
Citation
 Laggner, CSchieferer, CFiechtner, BPoles, GHoffmann, RDGlossmann, HLanger, TMoebius, FF Discovery of high-affinity ligands of sigma1 receptor, ERG2, and emopamil binding protein by pharmacophore modeling and virtual screening. J Med Chem 48:4754-64 (2005)  
Target
Name:
Sigma non-opioid intracellular receptor 1
Synonyms:
Aging-associated gene 8 protein SGMR1_HUMAN SIGMAR1 SR31747-binding protein Sigma 1-type opioid receptor Sigma1R | hSigmaR1
Type:
Enzyme Catalytic Domain
Mol. Mass.:
25124.85
Organism:
Homo sapiens (Human)
Description:
Q99720
Residue:
223
  
Inhibitor
Name:
BDBM50170652
Synonyms:
(2R,6S)-2,6-Dimethyl-4-tridecyl-morpholine | CHEMBL365842
Type:
Small organic molecule
Emp. Form.:
C19H39NO
Mol. Mass.:
297.5191
SMILES:
CCCCCCCCCCCCCN1C[C@H](C)O[C@H](C)C1
: