Target
Cytochrome P450 2A5
Ligand
BDBM50159252
Substrate
Meas. Tech.
ChEMBL_305268 (CHEMBL832818)
IC50
13000±n/a nM
Citation
 Rahnasto, MRaunio, HPoso, AWittekindt, CJuvonen, RO Quantitative structure-activity relationship analysis of inhibitors of the nicotine metabolizing CYP2A6 enzyme. J Med Chem 48:440-9 (2005)  
Target
Name:
Cytochrome P450 2A5
Synonyms:
CP2A5_MOUSE Cyp2a5
Type:
PROTEIN
Mol. Mass.:
56752.73
Organism:
Mus musculus
Description:
ChEMBL_572014
Residue:
494
  
Inhibitor
Name:
BDBM50159252
Synonyms:
1-chloro-2-phenylbenzene 2-Chlorobiphenyl 2-chloro-1,1'-biphenyl CHEMBL191745 o-chlorodiphenyl
Type:
Small organic molecule
Emp. Form.:
C12H9Cl
Mol. Mass.:
188.653
SMILES:
Clc1ccccc1-c1ccccc1
: