Target
Cytochrome P450 2A5
Ligand
BDBM50159272
Substrate
Meas. Tech.
ChEMBL_305268 (CHEMBL832818)
IC50
2500±n/a nM
Citation
 Rahnasto, MRaunio, HPoso, AWittekindt, CJuvonen, RO Quantitative structure-activity relationship analysis of inhibitors of the nicotine metabolizing CYP2A6 enzyme. J Med Chem 48:440-9 (2005)  
Target
Name:
Cytochrome P450 2A5
Synonyms:
CP2A5_MOUSE Cyp2a5
Type:
PROTEIN
Mol. Mass.:
56752.73
Organism:
Mus musculus
Description:
ChEMBL_572014
Residue:
494
  
Inhibitor
Name:
BDBM50159272
Synonyms:
2-Bromo-naphthalene CHEMBL192643
Type:
Small organic molecule
Emp. Form.:
C10H7Br
Mol. Mass.:
207.067
SMILES:
Brc1ccc2ccccc2c1
: