Target
5-hydroxytryptamine receptor 3A/3B/3C/3D/3E
Ligand
BDBM50173949
Substrate
Meas. Tech.
ChEMBL_320909 (CHEMBL881236)
Ki
409±n/a nM
Citation
 Baker, SRBoot, JBrunavs, MDobson, DGreen, RHayhurst, LKeenan, MWallace, L High affinity ligands for the alpha7 nicotinic receptor that show no cross-reactivity with the 5-HT3 receptor. Bioorg Med Chem Lett 15:4727-30 (2005)  
Target
Name:
5-hydroxytryptamine receptor 3A/3B/3C/3D/3E
Synonyms:
Serotonin 3 (5-HT3) receptor | Serotonin 3a (5-HT3a)/3b (5-HT3b)/3c (5-HT3c)/3d (5-HT3d)/3e (5-HT3e) receptor
Type:
Mol. Mass.:
Description:
ASSAY_ID of EBI is 3422
Components:
This complex has 5 components.
Component 1
Name:
5-hydroxytryptamine receptor 3A
Synonyms:
5-HT-3 5-HT3A 5-hydroxytryptamine receptor 3 (5-HT3) 5-hydroxytryptamine receptor 3A (5HT3A) 5HT3R HTR3A Serotonin 3 receptor (5HT3) Serotonin-gated ion channel receptor | Serotonin-gated ion channel receptor 3
Type:
Protein
Mol. Mass.:
55283.27
Organism:
Homo sapiens (Human)
Description:
P46098
Residue:
478
  
Component 2
Name:
5-hydroxytryptamine receptor 3B
Synonyms:
5-HT-3B 5-hydroxytryptamine receptor 3B HTR3B Serotonin receptor 3B
Type:
PROTEIN
Mol. Mass.:
50281.60
Organism:
Homo sapiens (Human)
Description:
EBI_11305
Residue:
441
  
Component 3
Name:
5-hydroxytryptamine receptor 3C
Synonyms:
5HT3C_HUMAN Serotonin (5-HT3) receptor
Type:
PROTEIN
Mol. Mass.:
50216.00
Organism:
Homo sapiens (Human)
Description:
EBI_12117
Residue:
447
  
Component 4
Name:
5-hydroxytryptamine receptor 3D
Synonyms:
5HT3D_HUMAN Serotonin (5-HT3) receptor
Type:
PROTEIN
Mol. Mass.:
50209.16
Organism:
Homo sapiens (Human)
Description:
EBI_12960
Residue:
454
  
Component 5
Name:
5-hydroxytryptamine receptor 3E
Synonyms:
5HT3E_HUMAN Serotonin (5-HT3) receptor
Type:
PROTEIN
Mol. Mass.:
51440.34
Organism:
Homo sapiens (Human)
Description:
EBI_14002
Residue:
456
  
Inhibitor
Name:
BDBM50173949
Synonyms:
5-Phenyl-thiophene-3-carboxylic acid (1-aza-bicyclo[2.2.2]oct-3-yl)-amide | CHEMBL195800
Type:
Small organic molecule
Emp. Form.:
C18H20N2OS
Mol. Mass.:
312.429
SMILES:
O=C(NC1CN2CCC1CC2)c1csc(c1)-c1ccccc1
: