Target
Melanocortin receptor 4
Ligand
BDBM50181497
Substrate
Meas. Tech.
ChEMBL_330380 (CHEMBL853032)
Ki
1.7±n/a nM
Citation
 Hogan, KPeluso, SGould, SParsons, IRyan, DWu, LVisiers, I Mapping the binding site of melanocortin 4 receptor agonists: a hydrophobic pocket formed by I3.28(125), I3.32(129), and I7.42(291) is critical for receptor activation. J Med Chem 49:911-22 (2006)  
Target
Name:
Melanocortin receptor 4
Synonyms:
MC4-R MC4R_HUMAN Melanocortin receptor 4 (MC-4) Melanocortin receptor 4 (MC4R)
Type:
Enzyme
Mol. Mass.:
36949.50
Organism:
Homo sapiens (Human)
Description:
P32245
Residue:
332
  
Inhibitor
Name:
BDBM50181497
Synonyms:
CHEMBL267492 | c[Thr-Tyr-Thr-His-DNaf-Arg-Trp-Thr-Ile-Pro]
Type:
Small organic molecule
Emp. Form.:
C68H88N16O14
Mol. Mass.:
1353.5251
SMILES:
CC[C@@H](C)[C@H]1NC(=O)[C@H](NC(=O)[C@@H](Cc2c[nH]c3ccccc23)NC(=O)[C@H](CCCN=C(N)N)NC(=O)[C@@H](Cc2cccc3ccccc23)NC(=O)[C@H](Cc2cnc[nH]2)NC(=O)[C@@H](NC(=O)[C@H](Cc2ccc(O)cc2)NC(=O)[C@@H](NC(=O)[C@H]2CCCN2C1=O)[C@@H](C)O)[C@@H](C)O)[C@@H](C)O
: