Target
Melanocortin receptor 4
Ligand
BDBM50181498
Substrate
Meas. Tech.
ChEMBL_330381 (CHEMBL853033)
Ki
114±n/a nM
Citation
 Hogan, KPeluso, SGould, SParsons, IRyan, DWu, LVisiers, I Mapping the binding site of melanocortin 4 receptor agonists: a hydrophobic pocket formed by I3.28(125), I3.32(129), and I7.42(291) is critical for receptor activation. J Med Chem 49:911-22 (2006)  
Target
Name:
Melanocortin receptor 4
Synonyms:
MC4-R MC4R_HUMAN Melanocortin receptor 4 (MC-4) Melanocortin receptor 4 (MC4R)
Type:
Enzyme
Mol. Mass.:
36949.50
Organism:
Homo sapiens (Human)
Description:
P32245
Residue:
332
  
Inhibitor
Name:
BDBM50181498
Synonyms:
(4-((1H-1,2,4-triazol-1-yl)methyl)-4-cyclohexylpiperidin-1-yl)((1R,2R,4R)-2-(4-chlorophenyl)-4-(dimethylamino)cyclopentyl)methanone | CHEMBL380691
Type:
Small organic molecule
Emp. Form.:
C28H40ClN5O
Mol. Mass.:
498.103
SMILES:
CN(C)[C@H]1C[C@H]([C@@H](C1)c1ccc(Cl)cc1)C(=O)N1CCC(Cn2cncn2)(CC1)C1CCCCC1
: