Target
Melanocortin receptor 4
Ligand
BDBM50142895
Substrate
Meas. Tech.
ChEMBL_330383 (CHEMBL853035)
Ki
120±n/a nM
Citation
 Hogan, KPeluso, SGould, SParsons, IRyan, DWu, LVisiers, I Mapping the binding site of melanocortin 4 receptor agonists: a hydrophobic pocket formed by I3.28(125), I3.32(129), and I7.42(291) is critical for receptor activation. J Med Chem 49:911-22 (2006)  
Target
Name:
Melanocortin receptor 4
Synonyms:
MC4-R MC4R_HUMAN Melanocortin receptor 4 (MC-4) Melanocortin receptor 4 (MC4R)
Type:
Enzyme
Mol. Mass.:
36949.50
Organism:
Homo sapiens (Human)
Description:
P32245
Residue:
332
  
Inhibitor
Name:
BDBM50142895
Synonyms:
2-(2-(5-bromo-2-methoxyphenethyl)-3-fluorophenyl)-4,5-dihydro-1H-imidazole 2-{2-[2-(5-Bromo-2-methoxy-phenyl)-ethyl]-3-fluoro-phenyl}-4,5-dihydro-1H-imidazole ML-253764
Type:
Small organic molecule
Emp. Form.:
C18H18BrFN2O
Mol. Mass.:
377.251
SMILES:
COc1ccc(Br)cc1CCc1c(F)cccc1C1=NCCN1
: