Target
Cytochrome P450 2D6
Ligand
BDBM768
Substrate
Meas. Tech.
ChEMBL_343532 (CHEMBL860702)
IC50
528000±n/a nM
Citation
 de Graaf, COostenbrink, CKeizers, PHvan der Wijst, TJongejan, AVermeulen, NP Catalytic site prediction and virtual screening of cytochrome P450 2D6 substrates by consideration of water and rescoring in automated docking. J Med Chem 49:2417-30 (2006)  
Target
Name:
Cytochrome P450 2D6
Synonyms:
CP2D6_HUMAN CYP2DL1 Cytochrome P450 2D6 (CYP2D6) P450-DB1
Type:
Protein
Mol. Mass.:
55774.82
Organism:
Homo sapiens (Human)
Description:
P10635
Residue:
497
  
Inhibitor
Name:
BDBM768
Synonyms:
4-hydroxy-3-(1-phenylpropyl)-2H-chromen-2-one phenprocoumon
Type:
Small organic molecule
Emp. Form.:
C18H16O3
Mol. Mass.:
280.3178
SMILES:
CCC(c1ccccc1)c1c(O)c2ccccc2oc1=O
: