Target
Mu-type opioid receptor
Ligand
BDBM50027229
Substrate
Meas. Tech.
ChEMBL_366645 (CHEMBL865967)
Ki
0.500000±n/a nM
Citation
 Ballet, SSalvadori, STrapella, CBryant, SDJinsmaa, YLazarus, LHNegri, LGiannini, ELattanzi, RTourwé, DBalboni, G New 2',6'-dimethyl-L-tyrosine (Dmt) opioid peptidomimetics based on the Aba-Gly scaffold. Development of unique mu-opioid receptor ligands. J Med Chem 49:3990-3 (2006)  
Target
Name:
Mu-type opioid receptor
Synonyms:
M-OR-1 MOR-1 MUOR1 Mu opiate receptor OPRM1 hMOP | mu-type opioid receptor isoform MOR-1
Type:
G Protein-Coupled Receptor (GPCR)
Mol. Mass.:
44789.51
Organism:
Homo sapiens (Human)
Description:
P35372
Residue:
400
  
Inhibitor
Name:
BDBM50027229
Synonyms:
CHEMBL2375157
Type:
Small organic molecule
Emp. Form.:
C32H37N5O3
Mol. Mass.:
539.6679
SMILES:
C[C@@H](CN1Cc2ccccc2C[C@H]1C(=O)NCC(=O)NCc1nc2ccccc2[nH]1)Cc1c(C)cc(O)cc1C
: