Target
Vasoactive intestinal polypeptide receptor 1
Ligand
BDBM50200209
Substrate
Meas. Tech.
ChEMBL_422597 (CHEMBL911646)
IC50
12±n/a nM
Citation
 Clairmont, KBBuckholz, TMPellegrino, CMBuxton, JMBarucci, NBell, AHa, SLi, FClaus, THSalhanick, AILumb, KJ Engineering of a VPAC2 receptor peptide agonist to impart dipeptidyl peptidase IV stability and enhance in vivo glucose disposal. J Med Chem 49:7545-8 (2006)  
Target
Name:
Vasoactive intestinal polypeptide receptor 1
Synonyms:
VIP 1 VIPR1_HUMAN | Vasoactive intestinal polypeptide receptor 1
Type:
Enzyme Catalytic Domain
Mol. Mass.:
51557.18
Organism:
Homo sapiens (Human)
Description:
VIP 1 VIPR1 0::P32241
Residue:
457
  
Inhibitor
Name:
BDBM50200209
Synonyms:
CHEMBL219499
Type:
Small organic molecule
Emp. Form.:
C142H223N39O40S
Mol. Mass.:
3148.592
SMILES:
CC[C@H](C)[C@H](NC(=O)CNC(=O)[C@H](CC(O)=O)NC(=O)[C@H](CO)NC(=O)[C@@H](N)Cc1cnc[nH]1)C(=O)N[C@@H](Cc1ccccc1)C(=O)N[C@@H]([C@@H](C)O)C(=O)N[C@@H](CC(O)=O)C(=O)N[C@@H](CO)C(=O)N[C@@H](Cc1ccc(O)cc1)C(=O)N[C@@H](CO)C(=O)N[C@@H](CCCN=C(N)N)C(=O)N[C@@H](Cc1ccc(O)cc1)C(=O)N[C@@H](CCCN=C(N)N)C(=O)N[C@@H](CCCCN)C(=O)N[C@@H](CCC(N)=O)C(=O)N[C@@H](CCSC)C(=O)N[C@@H](C)C(=O)N[C@@H](C(C)C)C(=O)N[C@@H](CCCCN)C(=O)N[C@@H](CCCCN)C(=O)N[C@@H](Cc1ccc(O)cc1)C(=O)N[C@@H](CC(C)C)C(=O)N[C@@H](C)C(=O)N[C@@H](C)C(=O)N[C@@H](C(C)C)C(=O)N[C@@H](CC(C)C)C(O)=O
: