Target
Peptide deformylase 1A, chloroplastic/mitochondrial
Ligand
BDBM50201877
Substrate
Meas. Tech.
ChEMBL_423228 (CHEMBL912247)
IC50
700000±n/a nM
Citation
 Boularot, AGiglione, CPetit, SDuroc, YAlves de Sousa, RLarue, VCresteil, TDardel, FArtaud, IMeinnel, T Discovery and refinement of a new structural class of potent peptide deformylase inhibitors. J Med Chem 50:10-20 (2007)  
Target
Name:
Peptide deformylase 1A, chloroplastic/mitochondrial
Synonyms:
AtDEF1 DEF1 PDF 1A Peptide deformylase 1A, chloroplastic | Polypeptide deformylase
Type:
PROTEIN
Mol. Mass.:
30001.50
Organism:
Arabidopsis thaliana
Description:
ChEMBL_423228
Residue:
269
  
Inhibitor
Name:
BDBM50201877
Synonyms:
2-(5-fluoro-1H-indol-3-yl)-N-hydroxyacetamide | CHEMBL219858
Type:
Small organic molecule
Emp. Form.:
C11H11FN2O2
Mol. Mass.:
222.2156
SMILES:
ONCC(=O)Cc1c[nH]c2ccc(F)cc12
: