Target
Peptide deformylase 1A, chloroplastic/mitochondrial
Ligand
BDBM50201878
Substrate
Meas. Tech.
ChEMBL_423228 (CHEMBL912247)
IC50
35000±n/a nM
Citation
 Boularot, AGiglione, CPetit, SDuroc, YAlves de Sousa, RLarue, VCresteil, TDardel, FArtaud, IMeinnel, T Discovery and refinement of a new structural class of potent peptide deformylase inhibitors. J Med Chem 50:10-20 (2007)  
Target
Name:
Peptide deformylase 1A, chloroplastic/mitochondrial
Synonyms:
AtDEF1 DEF1 PDF 1A Peptide deformylase 1A, chloroplastic | Polypeptide deformylase
Type:
PROTEIN
Mol. Mass.:
30001.50
Organism:
Arabidopsis thaliana
Description:
ChEMBL_423228
Residue:
269
  
Inhibitor
Name:
BDBM50201878
Synonyms:
CHEMBL220027 | N-(1-benzenesulfonyl-5-bromo-2-methyl-1H-indol-3-ylmethyl)-N-hydroxyformamide
Type:
Small organic molecule
Emp. Form.:
C17H15BrN2O4S
Mol. Mass.:
423.281
SMILES:
Cc1c(CN(O)C=O)c2cc(Br)ccc2n1S(=O)(=O)c1ccccc1
: