Target
Peptide deformylase 1A, chloroplastic/mitochondrial
Ligand
BDBM50201885
Substrate
Meas. Tech.
ChEMBL_423228 (CHEMBL912247)
IC50
500000±n/a nM
Citation
 Boularot, AGiglione, CPetit, SDuroc, YAlves de Sousa, RLarue, VCresteil, TDardel, FArtaud, IMeinnel, T Discovery and refinement of a new structural class of potent peptide deformylase inhibitors. J Med Chem 50:10-20 (2007)  
Target
Name:
Peptide deformylase 1A, chloroplastic/mitochondrial
Synonyms:
AtDEF1 DEF1 PDF 1A Peptide deformylase 1A, chloroplastic | Polypeptide deformylase
Type:
PROTEIN
Mol. Mass.:
30001.50
Organism:
Arabidopsis thaliana
Description:
ChEMBL_423228
Residue:
269
  
Inhibitor
Name:
BDBM50201885
Synonyms:
3-(3-acetylsulfanyl-2-oxopropyl)indole-1-carboxylic acid benzyl ester | CHEMBL262739
Type:
Small organic molecule
Emp. Form.:
C21H19NO4S
Mol. Mass.:
381.445
SMILES:
CC(=O)SCC(=O)Cc1cn(C(=O)OCc2ccccc2)c2ccccc12
: