Target
Peptide deformylase 1A, chloroplastic/mitochondrial
Ligand
BDBM50201882
Substrate
Meas. Tech.
ChEMBL_423228 (CHEMBL912247)
IC50
>1000000±n/a nM
Citation
 Boularot, AGiglione, CPetit, SDuroc, YAlves de Sousa, RLarue, VCresteil, TDardel, FArtaud, IMeinnel, T Discovery and refinement of a new structural class of potent peptide deformylase inhibitors. J Med Chem 50:10-20 (2007)  
Target
Name:
Peptide deformylase 1A, chloroplastic/mitochondrial
Synonyms:
AtDEF1 DEF1 PDF 1A Peptide deformylase 1A, chloroplastic | Polypeptide deformylase
Type:
PROTEIN
Mol. Mass.:
30001.50
Organism:
Arabidopsis thaliana
Description:
ChEMBL_423228
Residue:
269
  
Inhibitor
Name:
BDBM50201882
Synonyms:
3carboxymethylindol-1-carboxylic acid benzyl Ester | CHEMBL220466
Type:
Small organic molecule
Emp. Form.:
C18H15NO4
Mol. Mass.:
309.316
SMILES:
OC(=O)Cc1cn(C(=O)OCc2ccccc2)c2ccccc12
: