Target
Peptide deformylase 1A, chloroplastic/mitochondrial
Ligand
BDBM50201874
Substrate
Meas. Tech.
ChEMBL_423228 (CHEMBL912247)
IC50
>250000±n/a nM
Citation
 Boularot, AGiglione, CPetit, SDuroc, YAlves de Sousa, RLarue, VCresteil, TDardel, FArtaud, IMeinnel, T Discovery and refinement of a new structural class of potent peptide deformylase inhibitors. J Med Chem 50:10-20 (2007)  
Target
Name:
Peptide deformylase 1A, chloroplastic/mitochondrial
Synonyms:
AtDEF1 DEF1 PDF 1A Peptide deformylase 1A, chloroplastic | Polypeptide deformylase
Type:
PROTEIN
Mol. Mass.:
30001.50
Organism:
Arabidopsis thaliana
Description:
ChEMBL_423228
Residue:
269
  
Inhibitor
Name:
BDBM50201874
Synonyms:
CHEMBL425293 | N-[2-(5-bromo-2-methyl-1H-indole-3-yl)methyl]hydroxylamine
Type:
Small organic molecule
Emp. Form.:
C10H11BrN2O
Mol. Mass.:
255.111
SMILES:
Cc1[nH]c2ccc(Br)cc2c1CNO
: