Target
Adenosine receptor A3
Ligand
BDBM50205588
Substrate
Meas. Tech.
ChEMBL_435760 (CHEMBL904114)
Ki
85.2±n/a nM
Citation
 Baraldi, PGPreti, DTabrizi, MAFruttarolo, FSaponaro, GBaraldi, SRomagnoli, RMoorman, ARGessi, SVarani, KBorea, PA N(6)-[(hetero)aryl/(cyclo)alkyl-carbamoyl-methoxy-phenyl]-(2-chloro)-5'-N-ethylcarboxamido-adenosines: the first example of adenosine-related structures with potent agonist activity at the human A(2B) adenosine receptor. Bioorg Med Chem 15:2514-27 (2007)  
Target
Name:
Adenosine receptor A3
Synonyms:
A3 adenosine receptor (hA3) ADORA3 | Adenosine A3 receptor (A3AR)
Type:
G Protein-Coupled Receptor (GPCR)
Mol. Mass.:
36197.32
Organism:
Homo sapiens (Human)
Description:
P0DMS8
Residue:
318
  
Inhibitor
Name:
BDBM50205588
Synonyms:
(2S,3S,4R,5R)-N-ethyl-3,4-dihydroxy-5-(6-(4-(2-(4-iodophenylamino)-2-oxoethoxy)phenylamino)-9H-purin-9-yl)-tetrahydrofuran-2-carboxamide CHEMBL226242
Type:
Small organic molecule
Emp. Form.:
C26H26IN7O6
Mol. Mass.:
659.4324
SMILES:
CCNC(=O)[C@H]1O[C@H]([C@H](O)[C@@H]1O)n1cnc2c(Nc3ccc(OCC(=O)Nc4ccc(I)cc4)cc3)ncnc12
: