Target
Histidinol dehydrogenase
Ligand
BDBM50267468
Substrate
Meas. Tech.
ChEMBL_436509 (CHEMBL904815)
IC50
14.5±n/a nM
Citation
 Abdo, MRJoseph, PBoigegrain, RALiautard, JPMontero, JLKöhler, SWinum, JY Brucella suis histidinol dehydrogenase: synthesis and inhibition studies of a series of substituted benzylic ketones derived from histidine. Bioorg Med Chem 15:4427-33 (2007)  
Target
Name:
Histidinol dehydrogenase
Synonyms:
HISX_BRUSU | hisD
Type:
PROTEIN
Mol. Mass.:
46060.70
Organism:
Brucella suis
Description:
ChEMBL_436509
Residue:
430
  
Inhibitor
Name:
BDBM50267468
Synonyms:
(S)-3-amino-4-(1H-imidazol-4-yl)-1-(naphthalen-2-yl)butan-2-one dihydrochloride | CHEMBL477654
Type:
Small organic molecule
Emp. Form.:
C17H17N3O
Mol. Mass.:
279.3364
SMILES:
N[C@@H](Cc1cnc[nH]1)C(=O)Cc1ccc2ccccc2c1
: