Target
Histidinol dehydrogenase
Ligand
BDBM50267346
Substrate
Meas. Tech.
ChEMBL_436509 (CHEMBL904815)
IC50
20±n/a nM
Citation
 Abdo, MRJoseph, PBoigegrain, RALiautard, JPMontero, JLKöhler, SWinum, JY Brucella suis histidinol dehydrogenase: synthesis and inhibition studies of a series of substituted benzylic ketones derived from histidine. Bioorg Med Chem 15:4427-33 (2007)  
Target
Name:
Histidinol dehydrogenase
Synonyms:
HISX_BRUSU | hisD
Type:
PROTEIN
Mol. Mass.:
46060.70
Organism:
Brucella suis
Description:
ChEMBL_436509
Residue:
430
  
Inhibitor
Name:
BDBM50267346
Synonyms:
(S)-3-amino-1-(3,4-dichlorophenyl)-4-(1H-imidazol-4-yl)butan-2-one dihydrochloride | CHEMBL477675
Type:
Small organic molecule
Emp. Form.:
C13H13Cl2N3O
Mol. Mass.:
298.168
SMILES:
N[C@@H](Cc1cnc[nH]1)C(=O)Cc1ccc(Cl)c(Cl)c1
: